Common Terminology 1.1
type: ConceptScheme
description: Common Terminology 1.1 is common terms of MARC, MODS, DC and QDC. It is to achieve and improve metadata interoperability among different schema standards that have some different degree of generality or specificity.
rights: Free to all.
issued: 2014-05-26
modified: 2014-11-24
preferred label: Common Terminology
alternative label: Common Terminology(CT)
alternative label: CT
alternative label: ct
alternative label: ct1.1
has top concept: contributor
has top concept: date
has top concept: description
has top concept: format
has top concept: identifier
has top concept: language
has top concept: publisher
has top concept: relation
has top concept: rights
has top concept: subject
has top concept: title
has top concept: typeGenre

contributor
type: Concept
in scheme: Common Terminology 1.1
top concept of: Common Terminology 1.1
definition: The name of a person, organization, or event (conference, meeting, etc.) associated in some way with the resource (MODS). An entity responsible for making contributions to the resource (Contributor of DC). Including creator definition, an entity primarily responsible for making the resource (creator of DC).
note: Typically, the name of a Contributor should be used to indicate the entity. The qualifiers that indicate what type or role of contributor name is recorded are personal, corporate, meeting and role. Values can be literal or nonliteral (uri).
narrower: corporate name
narrower: meeting name
narrower: personal name
narrower: role
related: CTRelator
broad match: /mods/name/namePart
exact match: /edm/Agent/dc:identifier,edm:begin,edm:end,edm:isRelatedTo,owl:sameAs,rdaGr2:biographicalInformation,rdaGr2:dateOfBirth, rdaGr2:dateOfDeath,dateOfEstablishment,dateOfTermination,gender,placeOfBirth,placeOfDeath,professionOrOccupation,skos:altLabel,skos:note,skos:prefLabel

corporate name
type: Concept
in scheme: Common Terminology 1.1
definition: The name of a company, institution, or other organization (MODS) including a name of university or department.
note: Sub-property of contributor common term that indicates the name of a corporate. Values can be literal or nonliteral (uri).
exact match: /mods/name type="corporate"
narrow match: /qdc_MIT/contributor.department

meeting name
type: Concept
in scheme: Common Terminology 1.1
definition: The name of an event (conference, meeting, etc.) associated in some way with the resource(MODS).
note: Sub-property of contributor that indicates the name of a conference or related type of meeting (MODS). Values can be literal or nonliteral (uri).
exact match: /mods/name type="conference"

personal name
type: Concept
in scheme: Common Terminology 1.1
definition: The name of a person associated in some way with the resource (MODS).
note: Sub-property of contributor common term that indicates the name of a person. Values can be literal or nonliteral (uri).
exact match: /mods/name type="personal"
broad match: /mods_NLK/name[@type]
example: according to the value of name[@type], type will be decided:"personal", "corporate", or "meeting".

role
type: Concept
in scheme: Common Terminology 1.1
definition: Designates the relationship (role) of the entity recorded in name to the resource described in the record (MODS).
note: Roles of contributor such as author, creator, .... or other are defined in LC MARC relators in CTScheme. Values can be literal or nonliteral (uri).
related: LC MARC relators
narrower: author
narrower: creator
narrower: other

author
type: Concept
in scheme: Common Terminology 1.1
note: Values can be literal or nonliteral (uri).
narrow match: /qdc_MIT/contributor.mitauthor

creator
type: Concept
in scheme: Common Terminology 1.1
note: Values can be literal or nonliteral (uri).

other
type: Concept
in scheme: Common Terminology 1.1
note: Values can be literal or nonliteral (uri).
narrow match: /qdc_MIT/contributor.advisor
narrow match: /qdc_MIT/contributor.approver

date
type: Concept
in scheme: Common Terminology 1.1
top concept of: Common Terminology 1.1
definition: A point or period of time associated with an event in the lifecycle of the resource (DC).
note: Typically, date will be associated with the creation or availability of the resource. Recommended best practice for encoding the date value is defined in a profile of ISO 8601 [W3CDTF] and recommend to follow the YYYY-MM-DD format.
narrower: available date
narrower: copyright date
narrower: other date
narrower: issued date
narrower: modified date
narrow match: /edm/edm:TimeSpan/dcterms:isPartOf,owl:sameAs,skos:prefLabel
narrow match: /edm/ore:Proxy/edm:year

available date
type: Concept
in scheme: Common Terminology 1.1
definition: Date (often a range) that the resource will become or did become available (DC). A date in which the content of a resource is valid (MODS).
note: available date includes the concept of valid date.
exact match: /qdc/date valid,date available
narrow match: /dpla/sourceResource/displayDate
narrow match: /edm/header/datestamp
narrow match: /qdc_MIT/header/datestamp

copyright date
type: Concept
in scheme: Common Terminology 1.1
definition: A date in which a resource is copyrighted (MODS). Date of copyright(DCMI).
exact match: /marc/008_11-14 008_06=t,542_code_g
exact match: /qdc/date copyrighted

other date
type: Concept
in scheme: Common Terminology 1.1
definition: A date that does not fall into another category but is important to record (MODS). It includes accepted date, submitted, and accessioned date. Date of submission of the resource(DCMI). Date of acceptance of the resource(DCMI).
exact match: /marc/264 ind2=0_2_3,264_code_c
narrow match: /qdc_MIT/date.submitted,date.accessioned
narrow match: /dcterms/dateAccepted,dateSubmitted

issued date
type: Concept
in scheme: Common Terminology 1.1
definition: Date of formal issuance (e.g., publication) of the resource (DC). The date that the resource was published, released, or issued (MODS).
note: Describe an issued date of the described resource including a created date, the date of creation of the resource (MODS).
exact match: /marc/260_code_c,046_code_c_e,008_07-10,008_11-14,264 ind2=1,264_code_c
exact match: /qdc/date issued
narrow match: /marc/260_code_g,046_code_k_l,533_code_d,260_code_c Leader_06=d_f_p_t
narrow match: /mods/originInfo/dateCreated
narrow match: /qdc/date created
narrow match: /qdc_MIT/date.created
narrow match: /dcterms/created
narrow match: /edm/edm:WebResource,ore:Proxy/dcterms:created

modified date
type: Concept
in scheme: Common Terminology 1.1
definition: The date (often a range) in which a resource is modified or changed (DCMI).
exact match: /qdc/date modified

description
type: Concept
in scheme: Common Terminology 1.1
top concept of: Common Terminology 1.1
definition: An account of the resource (DC). A term that designates how the resource is issued (MODS).
note: Description may include but is not limited to: an abstract, table of contents, reference to a graphical representation of content or a free-text account of the content. Values can be literal or nonliteral (uri).
narrower: abstract
narrower: action
narrower: audience
narrower: bibliography
narrower: description other
narrower: edition
narrower: frequency
narrower: issuance
narrower: provenance
narrower: recordinfo
narrower: table of contents
related: CTDescription
broad match: /mods/extension
narrow match: /marc/502
narrow match: /mods/note type="thesis"

abstract
type: Concept
in scheme: Common Terminology 1.1
definition: A summary of the content of the resource (MODS).
note: Describe abstract including Summary, Subject, Review, Scope and content, Content advice. Values can be literal or nonliteral (uri).
exact match: /qdc/description abstract

action
type: Concept
in scheme: Common Terminology 1.1
definition: Information about processing, reference, and preservation actions (MODS).
note: Values can be literal or nonliteral (uri).
exact match: /mods/note type="action"
narrow match: /marc/007_13
mapping relation: /marc/007_13_code_a:access,007_13_code_p:preservation,007_13_code_r:replacement

audience
type: Concept
in scheme: Common Terminology 1.1
definition: A description of the intellectual level of the audience for which the resource is intended (MODS).
note: Use this element whenever there is a specific audience for a resource (MODS) based on MARC Target Audience Term List of LC MARC target in CTDescription of CTScheme. Values can be literal or nonliteral (uri).
related: LC MARC target
mapping relation: /marc/008_22_code_d:adolescent,008_22_code_e:adult,008_22_code_g:general,008_22_code_b_c_j:juvenile,008_22_code_a:preschool,008_22_code_f:specialized

bibliography
type: Concept
in scheme: Common Terminology 1.1
definition: A bibliographic reference for the resource(DCMI).description about bibliography.
note: Values can be literal or nonliteral (uri).
exact match: /mods/note type="bibliography"

description other
type: Concept
in scheme: Common Terminology 1.1
definition: A description of others that do not fall into another category including sponsorship, eprint status, degree, citation of MIT.
note: Values can be literal or nonliteral (uri).
narrow match: /mods/note type="funding"
narrow match: /qdc_MIT/description.sponsorship,eprint.status,description.degree
narrow match: /harvard/ut_count,ut_id,wp_categories

edition
type: Concept
in scheme: Common Terminology 1.1
definition: Information identifying the version of the resource (MODS).
note: Values can be literal or nonliteral (uri).
exact match: /mods/note type="version",note type="date_sequential designation",note type="version identification"

frequency
type: Concept
in scheme: Common Terminology 1.1
definition: A statement of publication frequency in a textual form (MODS).
note: Use to define the publication pattern of the item (MODS) based on LC MARC Frequency of Issue Term List of LCMARCfrequency in CTDescription of CTScheme. Values can be literal or nonliteral (uri).
related: LC MARC frequency
mapping relation: /marc/008_18_code_a:Annual,008_18_code_b:Bimonthly,008_18_code_c:Semiweekly,008_18_code_d:Daily,008_18_code_e:Biweekly,008_18_code_f:Semiannual, 008_18_code_g:Biennial,008_18_code_h:Triennial,008_18_code_i:Three times a week, 008_18_code_j:Three times a month,008_18_code_k:Continuously updated, 008_18_code_m:Monthly,008_18_code_q:Quarterly,008_18_code_s:Semimonthly,008_18_code_t:Three times a year,008_18_code_u:Unknown,008_18_code_w:Weekly,008_18_code_#:Completely irregula
exact match: /qdc/accrual periodicity

issuance
type: Concept
in scheme: Common Terminology 1.1
definition: A term that designates how the resource is issued (MODS).
note: Issuance values are as follows: monographic, single unit, multipart monograph, continuing, serial, and integrating resource (MODS). Values can be literal or nonliteral (uri).
mapping relation: /marc/Leader_07_code_b:continuing,Leader_07_code_a_c_d:monographic,Leader_07_code_m and Leader_19_code_a_b_c:multipart monograph, Leader_07_code_m and Leader_19_code_#:single unit, Leader_07_code_i:integrating resource, Leader_07_code_s:serial

provenance
type: Concept
in scheme: Common Terminology 1.1
definition: Information about the immediate source of acquisition of the described materials and is used primarily with original or historical items, or other archival collections.(MODS) Information concerning the ownership and custodial history of the described materials from the time of their creation to the time of their accessioning, including the time at which individual items or groups of items were first brought together in their current arrangement or collation.(MODS) including acquisition, Accrual Method. A statement of any changes in ownership and custody of the resource since its creation that are significant for its authenticity, integrity, and interpretation(DCMI).
note: Values can be literal or nonliteral (uri).
narrow match: /marc/561
exact match: /mods/note type="acquisition"
exact match: /mods/note type="ownership"
exact match: /qdc/provenance,accrual method
narrow match: /dpla/dataProvider
narrow match: /dpla/provider/@id,name
narrow match: /edm/ore:Aggregation/edm:dataProvider,edm:provider

recordinfo
type: Concept
in scheme: Common Terminology 1.1
definition: Information about the metadata record (MODS).
note: Describe record information of the described resource.including latest record transaction, record change, cataloging agency, language, transcribing agency, modifying agency, description conventions. Values can be literal or nonliteral (uri).
narrow match: /dpla/admin/validation_message,object_status,valid_after_enrich
narrow match: /dpla/@context,ingestDate,ingestionSequence,ingestType,@type

table of contents
type: Concept
in scheme: Common Terminology 1.1
definition: A description of the contents of a resource (MODS).
note: Values can be literal or nonliteral (uri).
exact match: /qdc/description tableofContents

format
type: Concept
in scheme: Common Terminology 1.1
top concept of: Common Terminology 1.1
definition: A designation of a particular physical presentation of a resource (form definition of MODS). The file format, physical medium, or dimensions of the resource (DC). It includes /mods/physicalDescription/reformattingQuality:Indicates an overall assessment of the physical quality of an electronic resource in relation to its intended use.(MODS)
narrower: extent
narrower: medium
related: CTFormat
narrow match: /mods/physicalDescription/reformattingQuality
broad match: /edm/skos:Concept
broad match: /edm/skos:Concept/skos:altLabel,skos:broader,skos:closeMatch,skos:narrower,skos:notation,skos:note,skos:prefLabel,skos:related
related: LCMARCform
exact match: /mods/physicalDescription/form,form authority="marcform"
mapping relation: /marc/008_23_MU_code_f,008_23_MM_code_f,008_29_MP_code_f,008_29_VM_code_f:braille,008_23_MU_code_s,008_23_MM_code_s,008_29_MP_code_s,008_29_VM_code_s:electronic, 008_23_MU_code_b,008_23_MM_code_b,008_29_MP_code_b,008_29_VM_code_b:microfiche,008_23_MU_code_a,008_23_MM_code_a,008_29_MP_code_a,008_29_VM_code_a:microfilm, 008_23_MU_code_''_r,008_23_MM_code_''_r,008_29_MP_code_''_r,008_29_VM_code_''_r,008_23_BK_code_''_r,008_23_CR_code_''_r,008_23_MU_code_''_r Leader_06=c_d:print
related: LCMARCcategory
exact match: /mods/physicalDescription/form authority="marccategory"
mapping relation: /marc/007_00_code_a:map,007_00_code_c:electronic resource,007_00_code_d:globe,007_00_code_f:tactile material,007_00_code_g:projected graphic,007_00_code_h:microform, 007_00_code_k:nonprojected graphic,007_00_code_m:motion picture,007_00_code_o:kit,007_00_code_q:notated music,007_00_code_r:remote sensing image, 007_00_code_s:sound recording,007_00_code_t:text,007_00_code_v:videorecording
narrow match: /marc/007_11_CF
narrow match: /mods/physicalDescription/digitalOrigin
mapping relation: /marc/007_11_CF_code_a:reformatted digital,007_11_CF_code_b:digitized microform,007_11_CF_code_d:digitized other analog
related: LCgmd
exact match: /mods/physicalDescription/form authority="gmd"

extent
type: Concept
in scheme: Common Terminology 1.1
definition: A statement of the number and specific material of the units of the resource that express physical extent (MODS). The size or duration of the resource (DC).
note: Values can be literal or nonliteral (uri).
exact match: /qdc/format extent

medium
type: Concept
in scheme: Common Terminology 1.1
definition: The material or physical carrier of the resource (DCMI-terms).
note: ”medium” uses internet media type (IMT) in Vocabulary Encoding Schemes (DC), where IMT is the set of media types specified by the Internet Assigned Numbers Authority on http://www.iana.org/assignments/media-types. It includes media, carrier, performance medium.
related: rfc2046
exact match: /qdc/format IMT,format Medium,format mimetype

identifier
type: Concept
in scheme: Common Terminology 1.1
top concept of: Common Terminology 1.1
definition: An unambiguous reference to the resource within a given context (DCMI). It includes "location" concept that identifies the institution or repository holding the resource, or a remote location in the form of a URL where it is available (MODS). And it includes "Source" concept, a related resource (database) from which the described resource is derived (DCMI), which identifies where the described resource comes from (e.g., Harvard, MIT, UIUC, or OCLC).
note: It may include the Uniform Resource Identifier (URI) including the Uniform Resource Locator (URL), the Digital Object Identifier (DOI), and the International Standard Book Number (ISBN). Values can be literal or nonliteral (uri).
narrower: collection
narrower: control number
narrower: doi
narrower: hdl
narrower: identifierOther
narrower: isbn
narrower: issn
narrower: issue number
narrower: lccn
narrower: object
narrower: source
narrower: uri
related: CTIdentifier
exact match: /marc/856_code_u ind2=3_4_5_6_7

collection
type: Concept
in scheme: Common Terminology 1.1
definition: An aggregation of resources(DCMI). it includes physicalLocation, which typically includes specific information used to locate a resource within a collection, such as the name or code of an institution/repository, and perhaps subcollection.(MODS)
note: Values can be literal or nonliteral (uri).

control number
type: Concept
in scheme: Common Terminology 1.1
definition: A serial or catalog number. Values can be literal or nonliteral (uri).
note: Values can be literal or nonliteral (uri).
narrow match: /qdc_MIT/identifier.oclc
narrow match: /harvard/id_oclc

doi
type: Concept
in scheme: Common Terminology 1.1
definition: digital object identifier (DOI).
note: digital object identifier (DOI): http://www.doi.org/. Values can be literal or nonliteral (uri).
exact match: /marc/856_code_u urn:doi,doi
exact match: /mods/identifier type="doi"
example: using identifier type="doi", if http://www.doi.org/ or doi is included in identifier.

hdl
type: Concept
in scheme: Common Terminology 1.1
definition: Handle System
note: Handle System: http://hdl.net/. Values can be literal or nonliteral (uri).
exact match: /marc/856_code_u urn:hdl,hdl
exact match: /mods/identifier type="hdl"
example: using identifier type="hdl", if http://hdl.handle.net or hdl is included in identifier.

identifierOther
type: Concept
in scheme: Common Terminology 1.1
definition: It includes isrc, ean, sici, upc, aleph, govdoc, or pmid identifiers.It includes ismn also, which is International Standard Music Number (ISO 10957) that uniquely identifies editions of notated music has been updated in the revised standard ISO 10957:2009 (ISO).
note: International Standard Music Number: http://www.iso.org/iso/home/news_index/news_archive/news.htm?refid=Ref1256. Values can be literal or nonliteral (uri).
narrow match: /marc/024_not_code_a ind1=2,994,024_code_a ind1=2
narrow match: /mods/identifier type="isrc",type="sici",type="upc",type="ismn"
narrow match: /qdc_MIT/identifier.aleph,identifier.govdoc,identifier.pmid,identifier.citation
narrow match: /qdc/identifier ismn
narrow match: /qdc_MIT/identifier.mitlicense
narrow match: /harvard/id_inst
narrow match: /dpla/_rev

isbn
type: Concept
in scheme: Common Terminology 1.1
definition: International Standard Book Number
note: International Standard Book Number: http://www.isbn.org/. Values can be literal or nonliteral (uri).
exact match: /mods/identifier type="isbn"

issn
type: Concept
in scheme: Common Terminology 1.1
definition: International Standard Serial Number: An 8-digit code used to identify newspapers, journals, magazines and periodicals of all kinds and on all media–print and electronic (issn).
note: International Standard Serial Number: http://www.issn.org/. Values can be literal or nonliteral (uri).
exact match: /mods/identifier type="issn"

issue number
type: Concept
in scheme: Common Terminology 1.1
definition: It includes matrix number, music publisher, music plate, or videorecording identifier.
note: Values can be literal or nonliteral (uri).
exact match: /mods/identifier type="issue number"

lccn
type: Concept
in scheme: Common Terminology 1.1
definition: Library of Congress Control Number, s serially based system of numbering cataloging records in the Library of Congress in the United States (Wikipedia).
note: Values can be literal or nonliteral (uri).
exact match: /mods/identifier type="lccn"

object
type: Concept
in scheme: Common Terminology 1.1
definition: An unambiguous URL reference to the DPLA digital content preview of the item.(DPLA).
note: Type=”ismn” is changed into type=”object”, since DPLA uses object for each item resource.

source
type: Concept
in scheme: Common Terminology 1.1
definition: A related resource from which the described resource is derived (DCMI, Dublin Core Metadata Element Set, Version 1.1). It identifies also where the described resource comes from (e.g., Harvard, MIT, UIUC, or OCLC).
note: Values can be literal or nonliteral (uri).
related: CTIdentifier
example: identifier source="Harvard"

uri
type: Concept
in scheme: Common Terminology 1.1
definition: Uniform resource identifier (uri).
exact match: /marc/856_code_u_y_3 ind2=#_0_1_2_8,856_code_z
narrow match: /mods/location/url
exact match: /qdc/identifier URI

language
type: Concept
in scheme: Common Terminology 1.1
top concept of: Common Terminology 1.1
definition: A language of the resource (DCMI). A designation of the language in which the content of a resource is expressed (MODS).
note: Values can be string or language codes.
related: CTLanguage
related: iso639-2
related: authority=”iso639-2”
exact match: /mods/language/languageTerm authority="iso639-2b"
exact match: /qdc/language ISO639-2
related: iso639-3
related: authority=”iso639-3”
exact match: /mods/language/languageTerm authority="iso639-3"
exact match: /qdc/language ISO639-3
related: rfc1766
related: authority=”rfc1766”
exact match: /mods/language/languageTerm authority="rfc1766"
exact match: /qdc/language RFC1766
related: rfc3066
related: authority=”rfc3066”
exact match: /mods/language/languageTerm authority="rfc3066"
exact match: /qdc/language RFC3066
related: rfc4646
related: authority=”rfc4646”
exact match: /mods/language/languageTerm authority="rfc4646"
exact match: /qdc/language RFC4646
related: MARC Code List for Languages

publisher
type: Concept
in scheme: Common Terminology 1.1
top concept of: Common Terminology 1.1
definition: The name of the entity that published, printed, distributed, released, issued, or produced the resource (MODS). An entity responsible for making the resource available (DCMI).
note: Typically, the name of a Publisher should be used to indicate the entity. Examples of a Publisher include a person, an organization, or a service. It includes "place"-Name of a place associated with the issuing, publication, release, distribution, manufacture, production, or origin of a resource (MODS). Values can be literal or nonliteral (uri).
narrower: place
related: iso3166
related: MARC Code List for Countries (Library of Congress)

place
type: Concept
in scheme: Common Terminology 1.1
definition: Name of a place associated with the issuing, publication, release, distribution, manufacture, production, or origin of a resource (MODS). It includes the concept of currentLocation of Europeana: The geographic location and/or name of the repository, building, site, or other entity whose boundaries presently include the resource(Europeana)
note: It can use authority=”iso3166” of CTSubject in CTScheme. Values can be literal or nonliteral (uri).
broad match: /harvard/holding_libs
broad match: /dpla/stateLocatedIn/name
broad match: /dpla/sourceResource/stateLocatedIn
broad match: /dpla/sourceResource/stateLocatedIn/name
broad match: /edm/edm:EuropeanaAggregation/edm:country
broad match: /edm/edm:Place
broad match: /edm/edm:Place/dcterms:hasPart,dcterms:isPartOf,owl:sameAs,skos:altLabel,skos:note,skos:prefLabel,wgs84:lat,wgs84:long
broad match: /edm/ore:Proxy/edm:currentLocation
related: iso3166
related: authority=”iso3166”
exact match: /mods/originInfo/place/placeTerm authority="iso3166"
exact match: /qdc/coverage spatial ISO3166
related: MARC Code List for Countries (Library of Congress)
related: authority=”marccountry"
exact match: /mods/originInfo/place/placeTerm authority="marccountry"

relation
type: Concept
in scheme: Common Terminology 1.1
top concept of: Common Terminology 1.1
definition: Information that identifies other resources related to the one being described (MODS). A related resource (DCMI).
narrower: has part
narrower: isPartOf
narrower: original
narrower: other format
narrower: other version
narrower: reference
narrower: replacement
narrower: requirement
exact match: /marc/856 ind2=2
narrow match: /mods/relatedItem/name/namePart
narrow match: /mods/relatedItem/recordInfo/recordIdentifier

has part
type: Concept
in scheme: Common Terminology 1.1
definition: Information concerning a constituent unit of the resource. This allows for more specific parsed information than may be used in 'tableOfContents' (MODS).
note: It includes Relation HasPart (QDC)-A related resource that is included either physically or logically in the described resource (DCMI). Values can be literal or nonliteral (uri).
exact match: /marc/700 ind2=2,710 ind2=2,711 ind2=2,730 ind2=2,740 ind2=2,770,774
exact match: /mods/relatedItem type="constituent"
exact match: /qdc/relation hasPart,relation hasPart uri

isPartOf
type: Concept
in scheme: Common Terminology 1.1
definition: A related resource in which the described resource is physically or logically included (DCMI), It includes series concept of MODS, information concerning the series in which a resource is issued (MODS).
note: It includes Relation IsPartOf (QDC),dc.relation.journal, or dc.relation.ispartofseries of MIT. Values can be literal or nonliteral (uri).
narrow match: /marc/440,760,762,800,810,811,830,490 ind1=0,772,773
narrow match: /mods/relatedItem type="series"
narrow match: /mods/relatedItem type="host"
exact match: /qdc/relation isPartOf,relation isPartOf uri
narrow match: /qdc_MIT/relation.journal,relation.ispartofseries

original
type: Concept
in scheme: Common Terminology 1.1
definition: Information concerning an original form of the resource (MODS).
note: It includes Source concept, a related resource from which the described resource is derived (DCMI), and Relation IsVersionOf of QDC:A related resource of which the described resource is a version, edition, or adaptation. Values can be literal or nonliteral (uri).
exact match: /mods/relatedItem type="original"
exact match: /qdc/source,source uri

other format
type: Concept
in scheme: Common Terminology 1.1
definition: Information concerning another format (i.e. change in physical format) of the resource (MODS).
note: It includes Relation HasFormat-A related resource that is substantially the same as the pre-existing described resource, but in another format (DCMI), and IsFormatOf(QDC)-A related resource that is substantially the same as the described resource, but in another format (DCMI). Values can be literal or nonliteral (uri).
exact match: /mods/relatedItem type="otherFormat"
narrow match: /qdc/relation hasFormat,isFormatOf,hasFormat uri,isFormatOf uri
narrow match: /dcterms/hasFormat,isFormatOf
example: depending on the value of /mods_NLK/relatedItem[@type], relation type will be decided, such as relation type="otherFormat"
narrow match: /edm/ore:Proxy/dcterms:hasFormat

other version
type: Concept
in scheme: Common Terminology 1.1
definition: Information concerning another version (i.e. change in intellectual content) of the resource (MODS).
note: It includes Relation HasVersion (QDC)-A related resource that is a version, edition, or adaptation of the described resource (DCMI), and dc.relation.isversionof- A related resource of which the described resource is a version, edition, or adaptation (DCMI). Values can be literal or nonliteral (uri).
exact match: /mods/relatedItem type="otherVersion"
narrow match: /qdc/relation hasVersion,hasVersion uri,isVersionOf,isVersionOf uri
narrow match: /dcterms/hasVersion,isVersionOf
narrow match: /qdc_MIT/relation.isversionof
narrow match: /edm/ore:Proxy/dcterms:isVersionOf

reference
type: Concept
in scheme: Common Terminology 1.1
definition: Information concerning a resource cited or referred to in the resource (MODS). A related resource that is referenced, cited, or otherwise pointed to by the described resource (DCMI).
note: It includes Relation IsReferencedBy of QDC. MODS -Citations or references to published bibliographic descriptions, reviews, abstracts, or indexes of the content of the resource (MODS). Values can be literal or nonliteral (uri).
narrow match: /mods/relatedItem type="isReferencedBy"
narrow match: /qdc/relation isReferencedBy,references,isReferencedBy uri,references uri
narrow match: /dcterms/references,isReferencedBy
narrow match: /edm/ore:Proxy/dcterms:isReferencedBy,dcterms:references

replacement
type: Concept
in scheme: Common Terminology 1.1
definition: A related resource that is supplanted, displaced, or superseded by the described resource-Replaces (DCMI).
note: It includes preceding-Information concerning a predecessor to the resource (MODS), succeeding-Information concerning a successor to the resource (MODS), or dc.relation.isreplacedby- A related resource that supplants, displaces, or supersedes the described resource (DCMI). Values can be literal or nonliteral (uri).
narrow match: /marc/780,785
narrow match: /mods/relatedItem type="preceding",relatedItem type="succeeding"
narrow match: /qdc/relation replaces,replaces uri,isReplacedBy,isReplacedBy uri
narrow match: /dcterms/isReplacedBy,replaces
narrow match: /edm/ore:Proxy/dcterms:isReplacedBy,dcterms:replaces

requirement
type: Concept
in scheme: Common Terminology 1.1
definition: A related resource that is required by the described resource to support its function, delivery, or coherence-Requires (DCMI).
note: It includes Relation Requires (QDC), and Is Required By (QDC)-A related resource that requires the described resource to support its function, delivery, or coherence (DCMI). Values can be literal or nonliteral (uri).
narrow match: /qdc/relation requires,requires uri,isRequiredBy,isRequiredBy uri
narrow match: /dcterms/requires,isRequiredBy
narrow match: /edm/ore:Proxy/dcterms:requires

rights
type: Concept
in scheme: Common Terminology 1.1
top concept of: Common Terminology 1.1
definition: Information about rights held in and over the resource (DCMI). Information about restrictions imposed on access to a resource (MODS).
note: It includes license-A legal document giving official permission to do something with the resource (DCMI), such as dc.identifier.mitlicense of MIT, and dc.description.statementofresponsibility. Values can be literal or nonliteral (uri).
narrower: access
exact match: /mods/accessCondition,accessCondition type="useAndReproduction"
narrow match: /qdc_MIT/description.statementofresponsibility
narrow match: /marc/245_code_c,542
narrow match: /qdc/rights rightsHolder
narrow match: /qdc_MIT/rights.holder
narrow match: /dcterms/rightsHolder

access
type: Concept
in scheme: Common Terminology 1.1
definition: Rights AccessRights (QDC)-Information about who can access the resource or an indication of its security status (DCMI). it includes license-A legal document giving official permission to do something with the resource.
note: Values can be literal or nonliteral (uri)
exact match: /mods/accessCondition type="restrictionsOnAccess"
exact match: /qdc/rights accessRights
narrow match: /qdc_MIT/identifier.mitlicense

subject
type: Concept
in scheme: Common Terminology 1.1
top concept of: Common Terminology 1.1
definition: A term or phrase representing the primary topic(s) on which a work is focused (MODS). The topic of the resource (DC). It includes coverage concept that is the spatial or temporal topic of the resource, the spatial applicability of the resource, or the jurisdiction under which the resource is relevant (DC).
note: Typically, the subject will be represented using keywords, key phrases, or classification codes. Recommended best practice is to use a controlled vocabulary (MODS). Values can be literal or nonliteral (uri).
narrower: classification
narrower: spatial
narrower: temporal
broad match: /edm/skos:Concept
broad match: /edm/skos:Concept/skos:altLabel,skos:broader,skos:closeMatch,skos:narrower,skos:notation,skos:note,skos:prefLabel,skos:related
related: csh
related: authority=”csh"
exact match: /marc/600,610,611,630,648,650,651 ind2=5
exact match: /mods/subject authority="csh"
related: lcsh
related: authority=”lcsh”
exact match: /marc/600,610,611,630,648,650,651 ind2=0
exact match: /mods/subject authority="lcsh"
exact match: /qdc/subject LCSH
related: lcshac
related: authority="lcshac"
exact match: /marc/600,610,611,630,648,650,651 ind2=1
exact match: /mods/subject authority="lcshac"
related: mesh
related: authority="mesh"
exact match: /marc/600,610,611,630,648,650,651 ind2=2
exact match: /mods/subject authority="mesh"
exact match: /qdc/subject MeSH
related: nal
related: authority=”nal"
exact match: /marc/600,610,611,630,648,650,651 ind2=3
exact match: /mods/subject authority="nal"
related: rvm
related: authority=”rvm”
exact match: /marc/600,610,611,630,648,650,651 ind2=6
exact match: /mods/subject authority="rvm""

classification
type: Concept
in scheme: Common Terminology 1.1
definition: A designation applied to a resource that indicates the subject by applying a formal system of coding and organizing resources according to subject areas (MODS).
note: Values can be literal or nonliteral (uri).
related: candocs
related: authority=”candocs”
exact match: /marc/086_code_a ind1=1
exact match: /mods/classification authority="candocs"
related: ddc
related: authority=”ddc”
exact match: /mods/classification authority="ddc"
exact match: /qdc/subject DDC
related: lcc
related: authority=”lcc”
exact match: /mods/classification authority="lcc"
exact match: /qdc/subject LCC
related: nlm
related: authority=”nlm”
exact match: /mods/classification authority="nlm"
exact match: /qdc/subject NLM
related: subjectOther
related: authority=”subjectOther"
related: sudocs
related: authority=”sudocs”
exact match: /marc/086_code_a ind1=0
exact match: /mods/classification authority="sudocs"
related: tgn
related: authority=”tgn”
exact match: /marc/655_code_2=tgn ind2=7
exact match: /qdc/subject TGN
related: udc
related: authority=”udc”
exact match: /mods/classification authority="udc"
exact match: /qdc/subject UDC

spatial
type: Concept
in scheme: Common Terminology 1.1
definition: Spatial characteristics of the resource (DCMI). Used for geographic subject terms (MODS).
note: It includes coverage and spatial of DC-Spatial topic and spatial applicability may be a named place or a location specified by its geographic coordinates (DCMI), and coordinates, projection, scale, geographic information, or publishing country code of MODS. Recommended best practice is to use a controlled vocabulary such as the Thesaurus of Geographic Names [TGN] (DCMI). A jurisdiction may be a named administrative entity or a geographic place to which the resource applies (DCMI). Values can be literal or nonliteral (uri).
exact match: /marc/033_code_b_c,034,043,052,255,522,600_code_z,610_code_z,611_code_z,630_code_z,648_code_z, 650_coce_z,651_not_code_2=tgn ind2=7,653_code_a ind2=5,662,751,752
exact match: /qdc/coverage spatial
broad match: /dc/coverage
broad match: /dcterms/coverage
broad match: /edm/ore:Proxy/dc:coverage
related: iso3166
related: authority=”iso3166”
related: tgn
related: authority=”tgn”
exact match: /marc/651_code_2=tgn ind2=7
exact match: /qdc/coverage spatial TGN

temporal
type: Concept
in scheme: Common Terminology 1.1
definition: Temporal characteristics of the resource (DCMI). Used for chronological subject terms or temporal coverage (MODS).
note: Temporal topic may be a named period, date, or date range (DCMI). "temporal" is used for chronological subject terms or temporal coverage. Values can be literal or nonliteral (uri).
exact match: /marc/033_code_a,045,513,533_code_b,600_code_y,610_code_y,611_code_y,630_code_y,648_code_a, 650_coce_y,651_code_y,653_code_a ind2=4
exact match: /qdc/coverage temporal

title
type: Concept
in scheme: Common Terminology 1.1
top concept of: Common Terminology 1.1
definition: A word, phrase, character, or group of characters, normally appearing in a resource, that names it or the work contained in it (MODS). A name given to the resource (DCMI).
note: Values can be literal or nonliteral (uri).
narrower: abbreviated
narrower: alternative
narrower: part number and name
narrower: subtitle
narrower: translated

abbreviated
type: Concept
in scheme: Common Terminology 1.1
definition: Title as abbreviated for indexing or identification (MODS).
note: Values can be literal or nonliteral (uri).
exact match: /mods/titleInfo type="abbreviated"/title

alternative
type: Concept
in scheme: Common Terminology 1.1
definition: Varying form of the title if it contributes to the further identification of the item (MODS). An alternative name for the resource (DCMI).
note: Values can be literal or nonliteral (uri).
exact match: /mods/titleInfo type="alternative"/title
exact match: /qdc/title alternative

part number and name
type: Concept
in scheme: Common Terminology 1.1
definition: A part or section number of a title(MODS). A part or section name of a title(MODS)
note: Values can be literal or nonliteral (uri).

subtitle
type: Concept
in scheme: Common Terminology 1.1
definition: A word, phrase, character, or group of characters that contains the remainder of the title information after the title proper (MODS).
note: Values can be literal or nonliteral (uri).

translated
type: Concept
in scheme: Common Terminology 1.1
definition: Translation or transcription of the main title (MODS).
note: Values can be literal or nonliteral (uri).
exact match: /marc/242_code_a,246_code_a ind2=1
exact match: /mods/titleInfo type="translated"/title

typeGenre
type: Concept
in scheme: Common Terminology 1.1
top concept of: Common Terminology 1.1
definition: A term that specifies the characteristics and general type of content of the resource (MODS). The nature of the resource (DCMI).
note: It includes genre-A term(s) that designates a category characterizing a particular style, form, or content, such as artistic, musical, literary composition, etc. (MODS). Values can be string or language codes.
narrower: genre
related: CTTypeGenre
broad match: /edm/skos:Concept
broad match: /edm/skos:Concept/skos:altLabel,skos:broader,skos:closeMatch,skos:narrower,skos:notation,skos:note,skos:prefLabel,skos:related
related: DCMI type
exact match: /qdc/type DCMI Type Vocabulary
related: LC MARC type
mapping relation: /marc/Leader_06 a_t:Text,e_f:Cartographic,c_d:notated music, i:sound recording-nonmusical,j:sound recording-musical,k:still image,g:moving image,o:Kit,r:three dimensional object, m:software_multimedia,p:mixed material,Leader_07 a:Monographic component part,b:Serial component part, c:Collection,d:Subunit,i:Integrating resource,m:Monograph/Item,s:Serial

genre
type: Concept
in scheme: Common Terminology 1.1
definition: A term(s) that designates a category characterizing a particular style, form, or content, such as artistic, musical, literary composition, etc. The genre of the resource.
note: Values can be literal or nonliteral (uri).
related: LC MARC genre
exact match: /marc/655,047,336,653_code_a ind2=6,600_code_v,610_code_v,611_code_v,630_code_v,648_code_v,650_code_v,651_code_v
mapping relation: /marc/008_24_code_a:abstract or summary,008_33_code_a:art original,008_33_code_c:art reproduction, 008_25_code_e:atlas,,007_01_code_d:atlas,008_30-31_code_a:autobiography,008_24_code_b:bibliography, 008_34_code_a_b_c_d:biography,008_30-31_code_b:biography,008_24_code_5:calendar,008_24_code_c:catalog, 008_33_code_n:chart,008_24_code_6:comic or graphic novel,008_33_code_c:comic strip,008_29_code_1:conference publication, 008_30-31_code_c:conference publication,008_21_code_d:database,008_26_code_e:database,008_24_code_d:dictionary, 008_33_code_d:diorama,008_24_code_r:directory,008_24_code_k:discography,008_33_code_d:drama,008_30-31_code_d:drama, 008_24_code_e:encyclopedia,008_33_ code_e:essay,008_30-31_code_e:essay,008_30_code_1:festschrift,008_33_code_1:fiction, 008_30-31_code_f:fiction,008_24_code_q:filmography,008_33_code_f:filmstrip,008_33_code_o:flash card,008_30-31_code_o:folktale, 008_26_code_f:font,008_26_code_g:game,008_33_code_k:graphic,008_25_code_d:globe,008_28_code_a_c_f_i_l_m_o_s_u_z_|:government publication, 008_24_code_f:handbook,008_30-31_code_h:history,008_33_code_h:humor_satire,008_30-31_code_k:humor_satire, 008_24_code_i:index,008_30-31_code_i:instruction,008_30-31_code_t:interview,008_33_code_b:kit,008_30-31_code_j:language instruction, 008_24_code_w:law report or digest,008_24_code_g:legal article,008_24_code_v:legal case and case notes, 008_24_code_l:legislation,008_33_code_i:letter,008_21_code_l:loose-leaf,008_25_code_a_b_c:map,007_01_code_j:map, 008_30-31_code_m:memoir,008_33_code_p:microscope slide,008_33_code_q:model,007_01_code_q:model,008_33_code_m:motion picture, 008_21_code_n:newspaper,008_33_code_f:novel,008_26_code_a:numeric data,008_24_code_2:offprint,008_24_code_j:patent, 008_21_code_p:periodical,008_33_code_i:picture,008_33_code_p:poetry,008_30-31_code_p:poetry,008_24_code_p:programmed text, 008_33_code_r:realia,008_30-31_code_r:rehearsal,007_01_code_r:remote sensing image,008_30-31_code_g:reporting, 008_24_code_o:review,008_21_code_…

CTScheme
type: Collection
in scheme: Common Terminology 1.1
definition: A CTScheme is an enumerated set of resources used as a controlled set of values, including authorities, including Syntax Encoding Scheme of DCMI and Vocabulary Encoding Scheme. The CTScheme includes CTTypeGenre, CTFormat, CTRelator, CTLanguage, CTDescription, CTIdentifier, and CTSubject.
member: CTDescription
member: CTFormat
member: CTIdentifier
member: CTLanguage
member: CTRelator
member: CTSubject
member: CTTypeGenre

CTDescription
type: Collection
in scheme: Common Terminology 1.1
definition: CTDescription is a set of authorities: - LCMARCfrequency (LC, MARC Frequency of Issue Term List) - LCMARCtarget (LC, MARC Target Audience Term List)
member: LC MARC frequency
member: LC MARC target

CTFormat
type: Collection
in scheme: Common Terminology 1.1
definition: A set of authorities, the controlled list from which the value is taken (MODS), to define format. CTFormat has following authorities: - authority=”LCMARCform” (LC, MARC Form of Item Term List) - authority=”LCgmd” (LC) - authority=”rfc2046” (NWG)
member: LCgmd
member: LCMARCform
member: rfc2046

CTIdentifier
type: Collection
in scheme: Common Terminology 1.1
definition: CTIdentifier is a set of sources where the described resource comes from: mit, harvard, uiuc, oclc, DLC: Library of Congress, DPLA, RLIN Research Libraries Group, VEN Vendor (Harvard). It may include any organization, institution, or libraries that provide metadata records later.
member: Digital Public Library of America(DPLA)
member: Europeana
member: Harvard University
member: Massachusetts Institute of Technology
member: National Library of Korea

CTLanguage
type: Collection
in scheme: Common Terminology 1.1
definition: CTLanguage is a set of authorities that are standard language codes to describe languages. It includes: - iso639-2, http://www.loc.gov/standards/iso639-2/ (LC) - iso639-3, http://www-01.sil.org/iso639-3/codes.asp (SIL) - rfc1766: https://www.ietf.org/rfc/rfc1766.txt - rfc3066: https://www.ietf.org/rfc/rfc3066.txt - rfc4646: http://www.ietf.org/rfc/rfc4646.txt - MARCCodeListforLanguages: http://www.loc.gov/marc/languages/language_code.html (LC, MARCCodeListforLanguages Part 2: Code Sequence).
member: iso639-2
member: iso639-3
member: MARC Code List for Languages
member: rfc1766
member: rfc3066
member: rfc4646

CTRelator
type: Collection
in scheme: Common Terminology 1.1
definition: A set of authorities, the controlled list from which the value is taken (MODS), to define relator terms for role: - authority=”LCMARCrelators” which is lists for MARC and MODS relator values.
member: LC MARC relators

CTSubject
type: Collection
in scheme: Common Terminology 1.1
definition: CTSubject is a set of authorities for subject headings and classifications: - authority=”lcsh”, "lcshac","mesh", ”csh", ”nal", ”rvm”, ”iso3166”; for ”classification” - authority=”lcc”, "ddc",”udc”, ”nlm”, ”sudocs”, ”candocs”, ”tgn”, and ”other”.
member: csh
member: iso3166
member: lcsh
member: lcshac
member: mesh
member: nal
member: rvm
member: tgn
member: candocs
member: ddc
member: lcc
member: nlm
member: subjectOther
member: sudocs
member: udc
member: MARC Code List for Countries (Library of Congress)

CTTypeGenre
type: Collection
in scheme: Common Terminology 1.1
definition: A set of authorities to describe type/genre. CTTypeGenre includes the following authorities: • authority=”LCMARCtype” for MARC and MODS values of typeOfResource, • authority=”DCMItype” for DCMItype vocabulary • authority=”LCMARCgenre,” which is list of MARC Genre terms.
note: The CT uses MARC and MODS type of Resource values, and DCMItype vocabulary (if DCMI uses different type values with typeOfResouce of MODS and MARC), to accept all values of MARC, MODS, and DC.
member: DCMI type
member: LC MARC genre
member: LC MARC type

LC MARC frequency
type: Concept
in scheme: Common Terminology 1.1
definition: MARC Frequency of Issue Term List (LC).
note: MARC Frequency of Issue Term List: http://www.loc.gov/standards/valuelist/marcfrequency.html

LC MARC target
type: Concept
in scheme: Common Terminology 1.1
definition: MARC Target Audience Term List (LC).
note: MARC Target Audience Term List: http://www.loc.gov/standards/valuelist/marctarget.html

LCgmd
type: Concept
in scheme: Common Terminology 1.1
definition: Genre/Form Code and Term Source Codes (LC).
note: Genre/Form Code and Term Source Codes: http://www.loc.gov/standards/sourcelist/genre-form.html

LCMARCform
type: Concept
in scheme: Common Terminology 1.1
definition: MARC Form Category Term List.
note: MARC Form Category Term List: http://www.loc.gov/standards/valuelist/marccategory.html

rfc2046
type: Concept
in scheme: Common Terminology 1.1
definition: Multipurpose Internet Mail Extensions (MIME) Media Types
note: Multipurpose Internet Mail Extensions (MIME) Media Types: https://www.ietf.org/rfc/rfc2046.txt

Digital Public Library of America(DPLA)
type: Concept
in scheme: Common Terminology 1.1
definition: Digital Public Library of America resource
note: http://dp.la/

Europeana
type: Concept
in scheme: Common Terminology 1.1
definition: Europeana resource
note: http://europeana.eu/portal/

Harvard University
type: Concept
in scheme: Common Terminology 1.1
definition: Harvard resource
note: Harvard library resource: http://library.harvard.edu/

Massachusetts Institute of Technology
type: Concept
in scheme: Common Terminology 1.1
definition: MIT resource
note: MIT library resource: http://libraries.mit.edu/

National Library of Korea
type: Concept
in scheme: Common Terminology 1.1
definition: National Library of Korea resource
note: http://www.nl.go.kr/nl/index.jsp

iso639-2
type: Concept
in scheme: Common Terminology 1.1
definition: Codes for the representation of names of languages
note: iso639-2: http://www.loc.gov/standards/iso639-2/, http://www.loc.gov/standards/iso639-2/php/code_list.php

iso639-3
type: Concept
in scheme: Common Terminology 1.1
definition: >ISO 639-3 attempts to provide as complete an enumeration of languages as possible, including living, extinct, ancient, and constructed languages, whether major or minor, written or unwritten
note: iso639-3: http://www-01.sil.org/iso639-3/codes.asp

MARC Code List for Languages
type: Concept
in scheme: Common Terminology 1.1
note: MARCCodeListforLanguages: http://www.loc.gov/marc/languages/language_code.html.

rfc1766
type: Concept
in scheme: Common Terminology 1.1
definition: Tags for the Identification of Languages
note: rfc1766: https://www.ietf.org/rfc/rfc1766.txt

rfc3066
type: Concept
in scheme: Common Terminology 1.1
definition: Tags for Identification of Languages
note: rfc3066: https://www.ietf.org/rfc/rfc3066.txt

rfc4646
type: Concept
in scheme: Common Terminology 1.1
definition: Tags for Identifying Languages
note: rfc4646: http://www.ietf.org/rfc/rfc4646.txt

LC MARC relators
type: Concept
in scheme: Common Terminology 1.1
note: MARC Code List for Relators: http://www.loc.gov/marc/relators/relaterm.html

csh
type: Concept
in scheme: Common Terminology 1.1
definition: Canadian Subject Headings (CSH) is a list of subject headings in the English language, using controlled vocabulary, to access and express the subject content of documents on Canada and Canadian topics (CSH).
note: https://www.bac-lac.gc.ca/eng/services/canadian-subject-headings/Pages/canadian-subject-headings.aspx

iso3166
type: Concept
in scheme: Common Terminology 1.1
definition: Country Codes - ISO 3166
note: http://www.iso.org/iso/country_codes.htm.

lcsh
type: Concept
in scheme: Common Terminology 1.1
definition: Library of Congress Subject Headings
note: http://id.loc.gov/authorities/subjects.html

lcshac
type: Concept
in scheme: Common Terminology 1.1
definition: Lcshac : Library of Congress AC subject headings

mesh
type: Concept
in scheme: Common Terminology 1.1
definition: MeSH (Medical Subject Headings) is the NLM controlled vocabulary thesaurus used for indexing articles for PubMed (MeSH).
note: http://www.ncbi.nlm.nih.gov/mesh

nal
type: Concept
in scheme: Common Terminology 1.1
definition: National Agricultural Library subject category codes
note: http://agricola.nal.usda.gov/help/categorycodes.html

rvm
type: Concept
in scheme: Common Terminology 1.1
definition: RVM is a partially bilingual encyclopedic thesaurus whose terms are classified according to a specific syntax(RVM).
note: https://rvmweb.bibl.ulaval.ca/en/a-propos

tgn
type: Concept
in scheme: Common Terminology 1.1
definition: The Getty Thesaurus of Geographic Names
note: http://www.getty.edu/research/tools/vocabulary/tgn/

candocs
type: Concept
in scheme: Common Terminology 1.1
definition: Library of Congress Subject Headings

ddc
type: Concept
in scheme: Common Terminology 1.1
definition: Dewey Decimal Classification
note: http://www.oclc.org/dewey/resources/summaries.en.html

lcc
type: Concept
in scheme: Common Terminology 1.1
definition: Library of Congress Classification Outline
note: http://www.loc.gov/catdir/cpso/lcco/

nlm
type: Concept
in scheme: Common Terminology 1.1
definition: National Library of Medicine classification.
note: https://www.nlm.nih.gov/class/

subjectOther
type: Concept
in scheme: Common Terminology 1.1
definition: Classification number from a scheme not covered by one of the other number fields.
note: Uses a scheme other than the Library of Congress Classification, the classification systems of Library and Archives Canada, the National Library of Medicine, the National Agricultural Library, the U.S. Government Printing Office, Universal Decimal Classification, or Dewey Decimal Classification schemes. These latter numbers are recorded in fields 050 (Library of Congress Call Number), 055 (Classification Numbers Assigned in Canada), 060 (National Library of Medicine Call Number), 070 (National Agricultural Library Call Number), 086 (Government Document Classification Number), 080 (Universal Decimal Classification Number), and 082 (Dewey Decimal Classification Number), respectively. Field 084 is also used for numbers assigned from the CODOC system used in Canada to classify government documents.(MODS)

sudocs
type: Concept
in scheme: Common Terminology 1.1
definition: The Superintendent of Documents Classification System
note: http://www.archives.gov/research/alic/reference/admin-history/classification-system.html

udc
type: Concept
in scheme: Common Terminology 1.1
definition: Universal Decimal Classification is one of the most widely used classification schemes for all fields of knowledge(UDC consortium)
note: http://www.udcc.org

MARC Code List for Countries (Library of Congress)
type: Concept
in scheme: Common Terminology 1.1
definition: It contains a list of places and their associated two- or three-character lowercase alphabetic codes. The list includes individual codes for presently existing national entities, states of the United States, provinces and territories of Canada, divisions of the United Kingdom, and internationally recognized dependencies
note: https://www.loc.gov/marc/countries/

DCMI type
type: Concept
in scheme: Common Terminology 1.1
definition: DCMItype Vocabulary:The DCMItype Vocabulary provides a general, cross-domain list of approved terms that may be used as values for the Type element to identify the genre of a resource (DCMI).
note: http://dublincore.org/documents/dcmi-type-vocabulary/

LC MARC genre
type: Concept
in scheme: Common Terminology 1.1
definition: MARC Genre Term List
note: http://www.loc.gov/standards/valuelist/marcgt.html

LC MARC type
type: Concept
in scheme: Common Terminology 1.1
definition: MARC Code List for Content Types (LC).
note: http://www.loc.gov/standards/valuelist/marccontent.html